running 1 test test wrong_cpu_and_unmasked_queue_mutation_touch_no_backend ... FAILED failures: ---- wrong_cpu_and_unmasked_queue_mutation_touch_no_backend stdout ---- thread 'wrong_cpu_and_unmasked_queue_mutation_touch_no_backend' (41611215) panicked at tests/deferred_work.rs:528:46: called `Result::unwrap_err()` on an `Ok` value: Registration { namespace: 1, record: SourceRecord { state: Open, slot: 0, generation: 1, binding: Binding { device: 9, epoch: 1, owner: 101, cpu: 0 }, resource: 1 } } note: run with `RUST_BACKTRACE=1` environment variable to display a backtrace failures: wrong_cpu_and_unmasked_queue_mutation_touch_no_backend test result: FAILED. 0 passed; 1 failed; 0 ignored; 0 measured; 27 filtered out; finished in 0.00s Compiling turkos-os-deferred-work v0.1.0 (/reports/os-implementation/K981-K999-preparation-0bsVMr/mutant-missing-mask-gate/os-deferred-work) Finished `test` profile [unoptimized + debuginfo] target(s) in 0.49s Running tests/deferred_work.rs (reports/os-implementation/K981-K999-preparation-0bsVMr/mutant-missing-mask-gate/target/debug/build/turkos-os-deferred-work/bfb4bf5e81b06a44/out/deferred_work-bfb4bf5e81b06a44) error: test failed, to rerun pass `--test deferred_work`