running 2 tests test os_virtio_pci_common_positive ... ok test os_virtio_pci_common_negative ... FAILED failures: ---- os_virtio_pci_common_negative stdout ---- thread 'os_virtio_pci_common_negative' (49355843) panicked at /reports/os-implementation/K1470-virtio-pci-common-local-yNmm2L/mutant/kernel/tests/os/virtio_pci_common.rs:68:5: assertion `left == right` failed left: Ok(()) right: Err(StillActive) note: run with `RUST_BACKTRACE=1` environment variable to display a backtrace failures: os_virtio_pci_common_negative test result: FAILED. 1 passed; 1 failed; 0 ignored; 0 measured; 0 filtered out; finished in 0.00s