running 1 test test os_frame_metadata_pins_negative ... FAILED failures: ---- os_frame_metadata_pins_negative stdout ---- thread 'os_frame_metadata_pins_negative' (40830672) panicked at tests/metadata.rs:150:5: assertion failed: matches!(registry.pin(handle, 17), Err(Error::PinCapacity)) note: run with `RUST_BACKTRACE=1` environment variable to display a backtrace failures: os_frame_metadata_pins_negative test result: FAILED. 0 passed; 1 failed; 0 ignored; 0 measured; 13 filtered out; finished in 0.00s Compiling turkos-os-frame-metadata v0.1.0 (/reports/os-implementation/K721-K739-preparation-TFuAQv/mutant-pin-limit/os-frame-metadata) warning: unused variable: `owner` --> src/metadata.rs:274:43 | 274 | pub fn pin(&mut self, handle: Handle, owner: u64) -> Result { | ^^^^^ help: if this is intentional, prefix it with an underscore: `_owner` | = note: `#[warn(unused_variables)]` (part of `#[warn(unused)]`) on by default warning: `turkos-os-frame-metadata` (lib) generated 1 warning (run `cargo fix --lib -p turkos-os-frame-metadata` to apply 1 suggestion) Finished `test` profile [unoptimized + debuginfo] target(s) in 0.23s Running tests/metadata.rs (reports/os-implementation/K721-K739-preparation-TFuAQv/mutant-pin-limit/target/debug/build/turkos-os-frame-metadata/55cb84e7a70a83e7/out/metadata-55cb84e7a70a83e7) error: test failed, to rerun pass `--test metadata`