running 2 tests test os_turkfs_allocation_extent_growth_positive ... ok test os_turkfs_allocation_extent_growth_negative ... FAILED failures: ---- os_turkfs_allocation_extent_growth_negative stdout ---- thread 'os_turkfs_allocation_extent_growth_negative' (50309762) panicked at /reports/os-implementation/K1630-turkfs-growth-local-b1Y6ac/mutant/kernel/tests/os/turkfs_allocation_growth.rs:30:5: assertion `left == right` failed left: Ok(()) right: Err(NoSpace) note: run with `RUST_BACKTRACE=1` environment variable to display a backtrace failures: os_turkfs_allocation_extent_growth_negative test result: FAILED. 1 passed; 1 failed; 0 ignored; 0 measured; 0 filtered out; finished in 0.00s