running 1 test test spin::exhaustion_tests::retained_spin_depth_forbids_sleep_even_if_irq_state_is_corrupted ... FAILED failures: failures: spin::exhaustion_tests::retained_spin_depth_forbids_sleep_even_if_irq_state_is_corrupted test result: FAILED. 0 passed; 1 failed; 0 ignored; 0 measured; 5 filtered out; finished in 0.00s Compiling turkos-os-locking v0.1.0 (/reports/os-implementation/K961-K979-preparation-HHDGYT/mutant-spin-depth-allows-sleep/os-locking) Finished `test` profile [unoptimized + debuginfo] target(s) in 0.21s Running unittests src/lib.rs (reports/os-implementation/K961-K979-preparation-HHDGYT/mutant-spin-depth-allows-sleep/target/debug/build/turkos-os-locking/5813bd7aeb4d174b/out/turkos_os_locking-5813bd7aeb4d174b) thread 'spin::exhaustion_tests::retained_spin_depth_forbids_sleep_even_if_irq_state_is_corrupted' (41476467) panicked at src/spin.rs:269:9: assertion `left == right` failed left: Ok(Task { id: 1, generation: 1 }) right: Err(Context) note: run with `RUST_BACKTRACE=1` environment variable to display a backtrace error: test failed, to rerun pass `--lib`