running 1 test test failed_copy_and_rights_denial_keep_sender_handle ... FAILED failures: failures: failed_copy_and_rights_denial_keep_sender_handle test result: FAILED. 0 passed; 1 failed; 0 ignored; 0 measured; 2 filtered out; finished in 0.00s thread 'failed_copy_and_rights_denial_keep_sender_handle' (48561027) panicked at /reports/os-implementation/K1335-handles-transfer-local-preflight-gGoIFC/workspace/kernel/tests/os/handles_transfer.rs:89:5: assertion `left == right` failed left: Ok(1) right: Err(Fault) note: run with `RUST_BACKTRACE=1` environment variable to display a backtrace