running 1 test test unaligned_rodata_boundary_rejected ... FAILED failures: failures: unaligned_rodata_boundary_rejected test result: FAILED. 0 passed; 1 failed; 0 ignored; 0 measured; 8 filtered out; finished in 0.00s Compiling turkos-os-entry-sections v0.1.0 (/reports/os-implementation/K626-K629-XLzoBa/mutant-ignore-page-alignment/os-entry-sections) Finished `test` profile [unoptimized + debuginfo] target(s) in 0.19s Running tests/sections.rs (reports/os-implementation/K626-K629-XLzoBa/mutant-ignore-page-alignment/target/debug/build/turkos-os-entry-sections/8b855fd6dab4304a/out/sections-8b855fd6dab4304a) thread 'unaligned_rodata_boundary_rejected' (40739305) panicked at tests/sections.rs:39:5: assertion `left == right` failed left: Ok(Sections { image_start: 1074266112, text_start: 1074270208, text_end: 1074331648, rodata_end: 1074348048, bss_start: 1074352128, bss_end: 1074397184 }) right: Err(Misaligned) note: run with `RUST_BACKTRACE=1` environment variable to display a backtrace error: test failed, to rerun pass `--test sections`