running 1 test test os_dma_reset_negative ... FAILED failures: ---- os_dma_reset_negative stdout ---- thread 'os_dma_reset_negative' (41039541) panicked at tests/dma.rs:475:9: assertion `left == right` failed left: Ok(ResetWitness { status: 0, queue_ready: 1 }) right: Err(ResetUnanswered) note: run with `RUST_BACKTRACE=1` environment variable to display a backtrace failures: os_dma_reset_negative test result: FAILED. 0 passed; 1 failed; 0 ignored; 0 measured; 20 filtered out; finished in 0.00s Compiling turkos-os-frame-metadata v0.1.0 (/os-frame-metadata) Compiling turkos-os-dma-memory v0.1.0 (/reports/os-implementation/K781-K799-preparation-zLhH8b/mutant-ignore-reset-ready/os-dma-memory) Finished `test` profile [unoptimized + debuginfo] target(s) in 0.32s Running tests/dma.rs (reports/os-implementation/K781-K799-preparation-zLhH8b/mutant-ignore-reset-ready/target/debug/build/turkos-os-dma-memory/085ed0d7ca9a8439/out/dma-085ed0d7ca9a8439) error: test failed, to rerun pass `--test dma`