running 1 test test copy_fault_does_not_publish_sender ... FAILED failures: failures: copy_fault_does_not_publish_sender test result: FAILED. 0 passed; 1 failed; 0 ignored; 0 measured; 2 filtered out; finished in 0.00s thread 'copy_fault_does_not_publish_sender' (48535962) panicked at /reports/os-implementation/K1330-handles-owned-local-preflight-0l9ooL/workspace/kernel/tests/os/handles_owned.rs:65:5: assertion `left == right` failed left: OwnedSnapshot { queue: QueueSnapshot { objects: SharedSnapshot { generations: [1, 0], entries: [Some((4294967297, 10, 0, Rights(3))), None], resources: [Some((Channel(93), 1, false)), None], watchers: [None, None], next_wait: 1 }, slots: [None, None], head: 0, len: 0 }, senders: [Some(10), None] } right: OwnedSnapshot { queue: QueueSnapshot { objects: SharedSnapshot { generations: [1, 0], entries: [Some((4294967297, 10, 0, Rights(3))), None], resources: [Some((Channel(93), 1, false)), None], watchers: [None, None], next_wait: 1 }, slots: [None, None], head: 0, len: 0 }, senders: [None, None] } note: run with `RUST_BACKTRACE=1` environment variable to display a backtrace