running 1 test test os_buddy_split_positive ... FAILED failures: failures: os_buddy_split_positive test result: FAILED. 0 passed; 1 failed; 0 ignored; 0 measured; 17 filtered out; finished in 0.00s Compiling turkos-os-runtime-platform v0.1.0 (/os-runtime-platform) Compiling turkos-os-frame-authority v0.1.0 (/os-frame-authority) Compiling turkos-os-buddy-frames v0.1.0 (/reports/os-implementation/K741-K759-7jBhgr/mutant-duplicate-child/os-buddy-frames) Finished `test` profile [unoptimized + debuginfo] target(s) in 0.46s Running tests/buddy.rs (reports/os-implementation/K741-K759-7jBhgr/mutant-duplicate-child/target/debug/build/turkos-os-buddy-frames/aed4ac960f5fbb7a/out/buddy-aed4ac960f5fbb7a) thread 'os_buddy_split_positive' (41024060) panicked at tests/buddy.rs:79:52: called `Result::unwrap()` on an `Err` value: Audit note: run with `RUST_BACKTRACE=1` environment variable to display a backtrace error: test failed, to rerun pass `--test buddy`