running 1 test test kernel_mmio_and_high_half_addresses_never_reach_ram_adapter ... FAILED failures: failures: kernel_mmio_and_high_half_addresses_never_reach_ram_adapter test result: FAILED. 0 passed; 1 failed; 0 ignored; 0 measured; 19 filtered out; finished in 0.00s Compiling turkos-os-page-tables v0.1.0 (/os-page-tables) Compiling turkos-os-mapping v0.1.0 (/os-mapping) Compiling turkos-os-user-copy v0.1.0 (/reports/os-implementation/K861-K879-preparation-i9HtBB/mutant-kernel-pointer/os-user-copy) Finished `test` profile [unoptimized + debuginfo] target(s) in 0.44s Running tests/user_copy.rs (reports/os-implementation/K861-K879-preparation-i9HtBB/mutant-kernel-pointer/target/debug/build/turkos-os-user-copy/5970609a3e73beab/out/user_copy-5970609a3e73beab) thread 'kernel_mmio_and_high_half_addresses_never_reach_ram_adapter' (41150031) panicked at tests/user_copy.rs:318:9: assertion `left == right` failed left: Err(Mapping(Unmapped)) right: Err(OutsideWindow) note: run with `RUST_BACKTRACE=1` environment variable to display a backtrace error: test failed, to rerun pass `--test user_copy`