running 1 test test frame_canary_padding_and_bad_slot_refuse_ingress ... FAILED failures: ---- frame_canary_padding_and_bad_slot_refuse_ingress stdout ---- thread 'frame_canary_padding_and_bad_slot_refuse_ingress' (41252189) panicked at tests/exceptions.rs:205:5: assertion `left == right` failed left: Ok(Vector { slot: 8, origin: LowerAarch64, kind: Sync }) right: Err(Canary) note: run with `RUST_BACKTRACE=1` environment variable to display a backtrace failures: frame_canary_padding_and_bad_slot_refuse_ingress test result: FAILED. 0 passed; 1 failed; 0 ignored; 0 measured; 22 filtered out; finished in 0.00s Compiling turkos-os-exceptions v0.1.0 (/reports/os-implementation/K901-K919-preparation-EQ5mcc/mutant-missing-canary/os-exceptions) Finished `test` profile [unoptimized + debuginfo] target(s) in 0.26s Running tests/exceptions.rs (reports/os-implementation/K901-K919-preparation-EQ5mcc/mutant-missing-canary/target/debug/build/turkos-os-exceptions/75414a6222e92fd7/out/exceptions-75414a6222e92fd7) error: test failed, to rerun pass `--test exceptions`