running 1 test test work_return_failure_preserves_running_token_and_completion_credit_until_retry ... FAILED failures: ---- work_return_failure_preserves_running_token_and_completion_credit_until_retry stdout ---- thread 'work_return_failure_preserves_running_token_and_completion_credit_until_retry' (41615269) panicked at tests/deferred_work.rs:672:28: called `Result::unwrap()` on an `Err` value: (Binding, Work { namespace: 1, cpu: 0, record: JobRecord { state: Running, slot: 0, generation: 1, registration_slot: 0, registration_generation: 1, binding: Binding { device: 9, epoch: 1, owner: 101, cpu: 0 }, resource: 2, completions: 3, sequence: 1 }, resource: None, state: Serviced }) note: run with `RUST_BACKTRACE=1` environment variable to display a backtrace failures: work_return_failure_preserves_running_token_and_completion_credit_until_retry test result: FAILED. 0 passed; 1 failed; 0 ignored; 0 measured; 27 filtered out; finished in 0.00s Compiling turkos-os-deferred-work v0.1.0 (/reports/os-implementation/K981-K999-preparation-0bsVMr/mutant-work-return-lost-owner/os-deferred-work) Finished `test` profile [unoptimized + debuginfo] target(s) in 0.50s Running tests/deferred_work.rs (reports/os-implementation/K981-K999-preparation-0bsVMr/mutant-work-return-lost-owner/target/debug/build/turkos-os-deferred-work/bfb4bf5e81b06a44/out/deferred_work-bfb4bf5e81b06a44) error: test failed, to rerun pass `--test deferred_work`