running 1 test test failed_cancel_after_partial_hardware_write_quarantines_real_owner ... FAILED failures: failures: failed_cancel_after_partial_hardware_write_quarantines_real_owner test result: FAILED. 0 passed; 1 failed; 0 ignored; 0 measured; 20 filtered out; finished in 0.00s Compiling turkos-os-clock v0.1.0 (/reports/os-implementation/K941-K959-preparation-T8L8pi/mutant-failed-program-not-quarantined/os-clock) Finished `test` profile [unoptimized + debuginfo] target(s) in 0.31s Running tests/clock.rs (reports/os-implementation/K941-K959-preparation-T8L8pi/mutant-failed-program-not-quarantined/target/debug/build/turkos-os-clock/7e205e95b363aa97/out/clock-7e205e95b363aa97) thread 'failed_cancel_after_partial_hardware_write_quarantines_real_owner' (41399784) panicked at tests/clock.rs:378:5: assertion failed: bank.snapshot().faulted note: run with `RUST_BACKTRACE=1` environment variable to display a backtrace error: test failed, to rerun pass `--test clock`