running 1 test test context::exhaustion_tests::forged_private_generation_and_lost_deferred_thread_identity_refuse ... FAILED failures: failures: context::exhaustion_tests::forged_private_generation_and_lost_deferred_thread_identity_refuse test result: FAILED. 0 passed; 1 failed; 0 ignored; 0 measured; 4 filtered out; finished in 0.00s Compiling turkos-os-threads v0.1.0 (/reports/os-implementation/K1021-K1039-preparation-EkLAoy/mutant-stale-generation/os-threads) Compiling turkos-os-exceptions v0.1.0 (/reports/os-implementation/K1021-K1039-preparation-EkLAoy/mutant-stale-generation/os-exceptions) Compiling turkos-os-context-switch v0.1.0 (/reports/os-implementation/K1021-K1039-preparation-EkLAoy/mutant-stale-generation/os-context-switch) Finished `test` profile [unoptimized + debuginfo] target(s) in 0.34s Running unittests src/lib.rs (reports/os-implementation/K1021-K1039-preparation-EkLAoy/mutant-stale-generation/target/debug/build/turkos-os-context-switch/86d9cba2059b76f9/out/turkos_os_context_switch-86d9cba2059b76f9) thread 'context::exhaustion_tests::forged_private_generation_and_lost_deferred_thread_identity_refuse' (41791821) panicked at src/context.rs:1273:9: assertion failed: matches!(bank.cooperate(forged, b, c), Err(Error::Stale)) note: run with `RUST_BACKTRACE=1` environment variable to display a backtrace error: test failed, to rerun pass `--lib`