running 1 test test changed_actual_capture_before_commit_refuses_publication ... FAILED failures: failures: changed_actual_capture_before_commit_refuses_publication test result: FAILED. 0 passed; 1 failed; 0 ignored; 0 measured; 32 filtered out; finished in 0.00s Compiling turkos-os-threads v0.1.0 (/reports/os-implementation/K1021-K1039-preparation-EkLAoy/mutant-before-commit-revalidation-ignored/os-threads) Compiling turkos-os-exceptions v0.1.0 (/reports/os-implementation/K1021-K1039-preparation-EkLAoy/mutant-before-commit-revalidation-ignored/os-exceptions) Compiling turkos-os-context-switch v0.1.0 (/reports/os-implementation/K1021-K1039-preparation-EkLAoy/mutant-before-commit-revalidation-ignored/os-context-switch) warning: method `before` is never used --> src/context.rs:962:8 | 952 | impl Dispatch<'_, B, N> { | --------------------------------------------------- method in this implementation ... 962 | fn before(&self) -> Result<(), Error> { | ^^^^^^ | = note: `#[warn(dead_code)]` (part of `#[warn(unused)]`) on by default warning: `turkos-os-context-switch` (lib) generated 1 warning Finished `test` profile [unoptimized + debuginfo] target(s) in 0.42s Running tests/context.rs (reports/os-implementation/K1021-K1039-preparation-EkLAoy/mutant-before-commit-revalidation-ignored/target/debug/build/turkos-os-context-switch/1edf24f3bc102438/out/context-1edf24f3bc102438) thread 'changed_actual_capture_before_commit_refuses_publication' (41795799) panicked at tests/context.rs:263:14: explicit panic note: run with `RUST_BACKTRACE=1` environment variable to display a backtrace error: test failed, to rerun pass `--test context`