running 1 test test os_dma_barriers_positive ... FAILED failures: ---- os_dma_barriers_positive stdout ---- thread 'os_dma_barriers_positive' (41039032) panicked at tests/dma.rs:304:5: assertion `left == right` failed left: ["avail-index", "dmb-oshst", "queue-notify"] right: ["dmb-oshst", "avail-index", "dmb-oshst", "queue-notify"] note: run with `RUST_BACKTRACE=1` environment variable to display a backtrace failures: os_dma_barriers_positive test result: FAILED. 0 passed; 1 failed; 0 ignored; 0 measured; 20 filtered out; finished in 0.00s Blocking waiting for file lock on package cache Blocking waiting for file lock on package cache Compiling turkos-os-frame-metadata v0.1.0 (/os-frame-metadata) Compiling turkos-os-dma-memory v0.1.0 (/reports/os-implementation/K781-K799-preparation-zLhH8b/mutant-skip-publish-barrier/os-dma-memory) Finished `test` profile [unoptimized + debuginfo] target(s) in 0.35s Running tests/dma.rs (reports/os-implementation/K781-K799-preparation-zLhH8b/mutant-skip-publish-barrier/target/debug/build/turkos-os-dma-memory/085ed0d7ca9a8439/out/dma-085ed0d7ca9a8439) error: test failed, to rerun pass `--test dma`