running 2 tests test os_vfs_ro_cache_positive ... ok test os_vfs_ro_cache_negative ... FAILED failures: ---- os_vfs_ro_cache_negative stdout ---- thread 'os_vfs_ro_cache_negative' (50137313) panicked at /reports/os-implementation/K1595-vfs-ro-cache-local-wwMXeU/mutant/kernel/tests/os/vfs_ro_cache.rs:45:5: assertion `left == right` failed left: Ok(Some([65, 65, 65, 65, 65, 65, 65, 65, 65, 65, 65, 65, 65, 65, 65, 65])) right: Ok(None) note: run with `RUST_BACKTRACE=1` environment variable to display a backtrace failures: os_vfs_ro_cache_negative test result: FAILED. 1 passed; 1 failed; 0 ignored; 0 measured; 0 filtered out; finished in 0.00s