running 1 test test os_boot_contract_finalize_negative ... FAILED failures: failures: os_boot_contract_finalize_negative test result: FAILED. 0 passed; 1 failed; 0 ignored; 0 measured; 6 filtered out; finished in 0.00s Compiling turkos-os-boot-finalize v0.1.0 (/reports/os-implementation/K616-K619-bS0TbR/mutant-service-after-exit/os-boot-finalize) Finished `test` profile [unoptimized + debuginfo] target(s) in 0.22s Running tests/finalize.rs (reports/os-implementation/K616-K619-bS0TbR/mutant-service-after-exit/target/debug/build/turkos-os-boot-finalize/dc8785b6a9c612e2/out/finalize-dc8785b6a9c612e2) thread 'os_boot_contract_finalize_negative' (39858918) panicked at tests/finalize.rs:26:5: assertion `left == right` failed left: Ok(()) right: Err(ServiceAfterExit) note: run with `RUST_BACKTRACE=1` environment variable to display a backtrace error: test failed, to rerun pass `--test finalize`