running 1 test test bounded_walk_rejects_each_resource_limit ... FAILED failures: failures: bounded_walk_rejects_each_resource_limit test result: FAILED. 0 passed; 1 failed; 0 ignored; 0 measured; 24 filtered out; finished in 0.00s Compiling typenum v1.20.1 Compiling libc v0.2.190 Compiling cfg-if v1.0.5 Compiling turkos-bootinfo v0.0.1 (/bootinfo) Compiling turkos-os-runtime-platform v0.1.0 (/reports/os-implementation/K681-K699-EIVbNv/mutant-ignore-blob-limit/os-runtime-platform) Compiling hybrid-array v0.4.15 Compiling crypto-common v0.2.2 Compiling block-buffer v0.12.1 Compiling cpufeatures v0.3.1 Compiling digest v0.11.3 Compiling sha2 v0.11.0 Compiling turkos-kernel v0.0.1 (/kernel) Finished `test` profile [unoptimized + debuginfo] target(s) in 1.81s Running tests/platform.rs (reports/os-implementation/K681-K699-EIVbNv/mutant-ignore-blob-limit/target/debug/build/turkos-os-runtime-platform/c9d45d950d3548f7/out/platform-c9d45d950d3548f7) thread 'bounded_walk_rejects_each_resource_limit' (40879712) panicked at tests/platform.rs:247:9: assertion `left == right` failed left: Ok(TreeInfo { blob_bytes: 1048576, nodes: 57, depth: 6, properties: 230, references: 6 }) right: Err(BlobLimit) note: run with `RUST_BACKTRACE=1` environment variable to display a backtrace error: test failed, to rerun pass `--test platform`