running 1 test test eight_jobs_and_ninth_refusal_preserve_real_leases_and_loss_counts ... FAILED failures: ---- eight_jobs_and_ninth_refusal_preserve_real_leases_and_loss_counts stdout ---- thread 'eight_jobs_and_ninth_refusal_preserve_real_leases_and_loss_counts' (41612938) panicked at tests/deferred_work.rs:383:5: assertion `left == right` failed left: Err(Generation) right: Err(Full) note: run with `RUST_BACKTRACE=1` environment variable to display a backtrace failures: eight_jobs_and_ninth_refusal_preserve_real_leases_and_loss_counts test result: FAILED. 0 passed; 1 failed; 0 ignored; 0 measured; 27 filtered out; finished in 0.00s Compiling turkos-os-deferred-work v0.1.0 (/reports/os-implementation/K981-K999-preparation-0bsVMr/mutant-unaccounted-ninth-job/os-deferred-work) warning: method `occupied` is never used --> src/deferred_work.rs:708:8 | 531 | impl Queue { | --------------------------------------------------------------- method in this implementation ... 708 | fn occupied(&self) -> usize { | ^^^^^^^^ | = note: `#[warn(dead_code)]` (part of `#[warn(unused)]`) on by default warning: `turkos-os-deferred-work` (lib) generated 1 warning Finished `test` profile [unoptimized + debuginfo] target(s) in 0.54s Running tests/deferred_work.rs (reports/os-implementation/K981-K999-preparation-0bsVMr/mutant-unaccounted-ninth-job/target/debug/build/turkos-os-deferred-work/bfb4bf5e81b06a44/out/deferred_work-bfb4bf5e81b06a44) error: test failed, to rerun pass `--test deferred_work`