running 1 test test os_context_switch_preempt_negative ... FAILED failures: failures: os_context_switch_preempt_negative test result: FAILED. 0 passed; 1 failed; 0 ignored; 0 measured; 32 filtered out; finished in 0.00s Compiling turkos-os-exceptions v0.1.0 (/reports/os-implementation/K1021-K1039-preparation-EkLAoy/mutant-critical-timer-switch-admitted/os-exceptions) Compiling turkos-os-threads v0.1.0 (/reports/os-implementation/K1021-K1039-preparation-EkLAoy/mutant-critical-timer-switch-admitted/os-threads) Compiling turkos-os-context-switch v0.1.0 (/reports/os-implementation/K1021-K1039-preparation-EkLAoy/mutant-critical-timer-switch-admitted/os-context-switch) Finished `test` profile [unoptimized + debuginfo] target(s) in 0.42s Running tests/context.rs (reports/os-implementation/K1021-K1039-preparation-EkLAoy/mutant-critical-timer-switch-admitted/target/debug/build/turkos-os-context-switch/16bb6d0bbbc889bb/out/context-16bb6d0bbbc889bb) thread 'os_context_switch_preempt_negative' (41793477) panicked at tests/context.rs:98:5: assertion failed: matches!(bank.timer(a, b, original), Err(Error::Context)) note: run with `RUST_BACKTRACE=1` environment variable to display a backtrace error: test failed, to rerun pass `--test context`