running 1 test test replacement_root_preserves_page_owner_and_live_mapping_after_old_retirement ... FAILED failures: failures: replacement_root_preserves_page_owner_and_live_mapping_after_old_retirement test result: FAILED. 0 passed; 1 failed; 0 ignored; 0 measured; 13 filtered out; finished in 0.03s Compiling turkos-os-runtime-platform v0.1.0 (/os-runtime-platform) Compiling turkos-os-page-tables v0.1.0 (/reports/os-implementation/K801-K819-bFalcS/mutant-mapped-page-free/os-page-tables) Compiling turkos-os-frame-metadata v0.1.0 (/os-frame-metadata) Compiling turkos-os-frame-authority v0.1.0 (/os-frame-authority) Finished `test` profile [unoptimized + debuginfo] target(s) in 0.54s Running tests/tree.rs (reports/os-implementation/K801-K819-bFalcS/mutant-mapped-page-free/target/debug/build/turkos-os-page-tables/351e0aca2c5181f2/out/tree-351e0aca2c5181f2) thread 'replacement_root_preserves_page_owner_and_live_mapping_after_old_retirement' (41102213) panicked at tests/tree.rs:419:49: called `Result::unwrap_err()` on an `Ok` value: () note: run with `RUST_BACKTRACE=1` environment variable to display a backtrace error: test failed, to rerun pass `--test tree`