running 1 test test failed_rollback_keeps_actual_registry_handle_without_published_prefix ... FAILED failures: failures: failed_rollback_keeps_actual_registry_handle_without_published_prefix test result: FAILED. 0 passed; 1 failed; 0 ignored; 0 measured; 13 filtered out; finished in 0.00s Compiling turkos-os-runtime-platform v0.1.0 (/os-runtime-platform) Compiling turkos-os-page-tables v0.1.0 (/reports/os-implementation/K801-K819-bFalcS/mutant-forget-retained/os-page-tables) Compiling turkos-os-frame-metadata v0.1.0 (/os-frame-metadata) Compiling turkos-os-frame-authority v0.1.0 (/os-frame-authority) Finished `test` profile [unoptimized + debuginfo] target(s) in 0.55s Running tests/tree.rs (reports/os-implementation/K801-K819-bFalcS/mutant-forget-retained/target/debug/build/turkos-os-page-tables/351e0aca2c5181f2/out/tree-351e0aca2c5181f2) thread 'failed_rollback_keeps_actual_registry_handle_without_published_prefix' (41102874) panicked at tests/tree.rs:311:5: assertion `left == right` failed left: 0 right: 1 note: run with `RUST_BACKTRACE=1` environment variable to display a backtrace error: test failed, to rerun pass `--test tree`