running 1 test test irq_mask_write_failure_keeps_backend_quarantined ... FAILED failures: failures: irq_mask_write_failure_keeps_backend_quarantined test result: FAILED. 0 passed; 1 failed; 0 ignored; 0 measured; 33 filtered out; finished in 0.00s Compiling turkos-os-locking v0.1.0 (/reports/os-implementation/K961-K979-preparation-HHDGYT/mutant-irq-failed-write-unquarantined/os-locking) Finished `test` profile [unoptimized + debuginfo] target(s) in 0.45s Running tests/locking.rs (reports/os-implementation/K961-K979-preparation-HHDGYT/mutant-irq-failed-write-unquarantined/target/debug/build/turkos-os-locking/36db3b80b1dba7b1/out/locking-36db3b80b1dba7b1) thread 'irq_mask_write_failure_keeps_backend_quarantined' (41475327) panicked at tests/locking.rs:112:5: assertion `left == right` failed left: (0, 320, 0, false) right: (0, 320, 0, true) note: run with `RUST_BACKTRACE=1` environment variable to display a backtrace error: test failed, to rerun pass `--test locking`