running 1 test test os_threads_stacks_positive ... FAILED failures: failures: os_threads_stacks_positive test result: FAILED. 0 passed; 1 failed; 0 ignored; 0 measured; 21 filtered out; finished in 0.00s Compiling turkos-os-threads v0.1.0 (/reports/os-implementation/K1001-K1019-preparation-Vy7GRN/mutant-initial-sp-crosses-canary/os-threads) Finished `test` profile [unoptimized + debuginfo] target(s) in 0.28s Running tests/threads.rs (reports/os-implementation/K1001-K1019-preparation-Vy7GRN/mutant-initial-sp-crosses-canary/target/debug/build/turkos-os-threads/fc0d96e38d2f6d6f/out/threads-fc0d96e38d2f6d6f) thread 'os_threads_stacks_positive' (41561814) panicked at tests/threads.rs:173:9: assertion `left == right` failed left: 2147504128 right: 2147504112 note: run with `RUST_BACKTRACE=1` environment variable to display a backtrace error: test failed, to rerun pass `--test threads`