running 1 test test same_scope_foreign_tokens_cannot_act_on_matching_live_instances ... FAILED failures: failures: same_scope_foreign_tokens_cannot_act_on_matching_live_instances test result: FAILED. 0 passed; 1 failed; 0 ignored; 0 measured; 25 filtered out; finished in 0.00s Compiling turkos-os-gic v0.1.0 (/reports/os-implementation/K921-K939-preparation-7Bk1ve/mutant-foreign-registration/os-gic) warning: field `instance` is never read --> src/gic.rs:102:5 | 101 | pub struct Registration { | ------------ field in this struct 102 | instance: u64, | ^^^^^^^^ | = note: `Registration` has a derived impl for the trait `Debug`, but this is intentionally ignored during dead code analysis = note: `#[warn(dead_code)]` (part of `#[warn(unused)]`) on by default warning: `turkos-os-gic` (lib) generated 1 warning Finished `test` profile [unoptimized + debuginfo] target(s) in 0.38s Running tests/gic.rs (reports/os-implementation/K921-K939-preparation-7Bk1ve/mutant-foreign-registration/target/debug/build/turkos-os-gic/504a3f6ce8f6a297/out/gic-504a3f6ce8f6a297) thread 'same_scope_foreign_tokens_cannot_act_on_matching_live_instances' (41337145) panicked at tests/gic.rs:519:5: assertion `left == right` failed left: Ok(RetainedActive) right: Err(Foreign) note: run with `RUST_BACKTRACE=1` environment variable to display a backtrace error: test failed, to rerun pass `--test gic`