running 1 test test os_user_api_compatibility_negative ... FAILED failures: ---- os_user_api_compatibility_negative stdout ---- thread 'os_user_api_compatibility_negative' (47990016) panicked at tests/compatibility.rs:33:5: assertion `left == right` failed left: Ok(()) right: Err(Unsupported { required: 2, available: 1 }) note: run with `RUST_BACKTRACE=1` environment variable to display a backtrace failures: os_user_api_compatibility_negative test result: FAILED. 0 passed; 1 failed; 0 ignored; 0 measured; 2 filtered out; finished in 0.00s Compiling turkos-os-user-runtime-compat v0.1.0 (/reports/os-implementation/K1240-compat-local-preflight-OkZOu4/workspace/os-user-runtime-compat) Finished `test` profile [unoptimized + debuginfo] target(s) in 0.12s Running tests/compatibility.rs (reports/os-implementation/K1240-compat-local-preflight-OkZOu4/target/debug/build/turkos-os-user-runtime-compat/5c76b1d2f7a2061b/out/compatibility-5c76b1d2f7a2061b) error: test failed, to rerun pass `--test compatibility`