running 2 tests test os_turkfs_journal_reservation_positive ... ok test os_turkfs_journal_reservation_negative ... FAILED failures: ---- os_turkfs_journal_reservation_negative stdout ---- thread 'os_turkfs_journal_reservation_negative' (50553322) panicked at /reports/os-implementation/K1675-turkfs-reservation-local-zEIwLB/mutant/kernel/tests/os/turkfs_journal_reservation.rs:23:5: assertion `left == right` failed left: Ok(Reservation { start: 4, slots: 5, records: 3 }) right: Err(Full) note: run with `RUST_BACKTRACE=1` environment variable to display a backtrace failures: os_turkfs_journal_reservation_negative test result: FAILED. 1 passed; 1 failed; 0 ignored; 0 measured; 0 filtered out; finished in 0.00s