running 1 test test peer_death_drains_then_closed ... FAILED failures: failures: peer_death_drains_then_closed test result: FAILED. 0 passed; 1 failed; 0 ignored; 0 measured; 2 filtered out; finished in 0.00s thread 'peer_death_drains_then_closed' (48581355) panicked at /reports/os-implementation/K1340-handles-peer-local-preflight-VrU4hC/workspace/kernel/tests/os/handles_peer.rs:17:5: assertion `left == right` failed left: Ok(()) right: Err(PeerClosed) note: run with `RUST_BACKTRACE=1` environment variable to display a backtrace