running 1 test test os_runqueue_quantum_positive ... FAILED failures: failures: os_runqueue_quantum_positive test result: FAILED. 0 passed; 1 failed; 0 ignored; 0 measured; 21 filtered out; finished in 0.00s Compiling turkos-os-exceptions v0.1.0 (/reports/os-implementation/K1041-K1059-preparation-5hOulI/mutant-normal-quantum-two-charges/os-exceptions) Compiling turkos-os-threads v0.1.0 (/reports/os-implementation/K1041-K1059-preparation-5hOulI/mutant-normal-quantum-two-charges/os-threads) Compiling turkos-os-context-switch v0.1.0 (/reports/os-implementation/K1041-K1059-preparation-5hOulI/mutant-normal-quantum-two-charges/os-context-switch) Compiling turkos-os-runqueue v0.1.0 (/reports/os-implementation/K1041-K1059-preparation-5hOulI/mutant-normal-quantum-two-charges/os-runqueue) Finished `test` profile [unoptimized + debuginfo] target(s) in 0.69s Running tests/runqueue.rs (reports/os-implementation/K1041-K1059-preparation-5hOulI/mutant-normal-quantum-two-charges/target/debug/build/turkos-os-runqueue/baad547996e0f024/out/runqueue-baad547996e0f024) thread 'os_runqueue_quantum_positive' (41915603) panicked at tests/runqueue.rs:91:13: assertion `left == right` failed left: 2 right: 3 note: run with `RUST_BACKTRACE=1` environment variable to display a backtrace error: test failed, to rerun pass `--test runqueue`