running 1 test test deferred_work::tests::namespace_increment_never_wraps_or_reuses_zero ... FAILED failures: ---- deferred_work::tests::namespace_increment_never_wraps_or_reuses_zero stdout ---- thread 'deferred_work::tests::namespace_increment_never_wraps_or_reuses_zero' (41612486) panicked at src/deferred_work.rs:222:9: assertion `left == right` failed left: Ok(0) right: Err(Generation) note: run with `RUST_BACKTRACE=1` environment variable to display a backtrace failures: deferred_work::tests::namespace_increment_never_wraps_or_reuses_zero test result: FAILED. 0 passed; 1 failed; 0 ignored; 0 measured; 5 filtered out; finished in 0.00s Compiling turkos-os-deferred-work v0.1.0 (/reports/os-implementation/K981-K999-preparation-0bsVMr/mutant-wrapping-namespace/os-deferred-work) Finished `test` profile [unoptimized + debuginfo] target(s) in 0.24s Running unittests src/lib.rs (reports/os-implementation/K981-K999-preparation-0bsVMr/mutant-wrapping-namespace/target/debug/build/turkos-os-deferred-work/f5f2a0d501c10246/out/turkos_os_deferred_work-f5f2a0d501c10246) error: test failed, to rerun pass `--lib`