running 1 test test os_user_api_ownership_negative ... FAILED failures: ---- os_user_api_ownership_negative stdout ---- thread 'os_user_api_ownership_negative' (47968955) panicked at tests/ownership.rs:28:5: assertion `left == right` failed left: Inventory { live: 0, claims: 1, close_attempts: 3, closes: 1 } right: Inventory { live: 0, claims: 1, close_attempts: 2, closes: 1 } note: run with `RUST_BACKTRACE=1` environment variable to display a backtrace failures: os_user_api_ownership_negative test result: FAILED. 0 passed; 1 failed; 0 ignored; 0 measured; 2 filtered out; finished in 0.00s Compiling turkos-os-user-runtime-handle v0.1.0 (/reports/os-implementation/K1235-handle-local-preflight-4ywjGv/workspace/os-user-runtime-handle) Finished `test` profile [unoptimized + debuginfo] target(s) in 0.12s Running tests/ownership.rs (reports/os-implementation/K1235-handle-local-preflight-4ywjGv/target/debug/build/turkos-os-user-runtime-handle/39fe344a6a3a5c85/out/ownership-39fe344a6a3a5c85) error: test failed, to rerun pass `--test ownership`