running 1 test test private_mutex_payload_requires_the_current_task_and_exact_owned_lease ... FAILED failures: failures: private_mutex_payload_requires_the_current_task_and_exact_owned_lease test result: FAILED. 0 passed; 1 failed; 0 ignored; 0 measured; 33 filtered out; finished in 0.00s Compiling turkos-os-locking v0.1.0 (/reports/os-implementation/K961-K979-preparation-HHDGYT/mutant-mutex-foreign-payload-access/os-locking) Finished `test` profile [unoptimized + debuginfo] target(s) in 0.42s Running tests/locking.rs (reports/os-implementation/K961-K979-preparation-HHDGYT/mutant-mutex-foreign-payload-access/target/debug/build/turkos-os-locking/36db3b80b1dba7b1/out/locking-36db3b80b1dba7b1) thread 'private_mutex_payload_requires_the_current_task_and_exact_owned_lease' (41480830) panicked at tests/locking.rs:881:5: assertion `left == right` failed left: Ok(()) right: Err(Foreign) note: run with `RUST_BACKTRACE=1` environment variable to display a backtrace error: test failed, to rerun pass `--test locking`