running 2 tests test os_virtio_status_positive ... FAILED test os_virtio_status_negative_and_recovery ... FAILED failures: ---- os_virtio_status_positive stdout ---- thread 'os_virtio_status_positive' (49464304) panicked at /reports/os-implementation/K1480-virtio-status-local-gxOYsT/mutant/kernel/tests/os/virtio_status.rs:16:5: assertion `left == right` failed left: Ok(()) right: Err(StillLive) ---- os_virtio_status_negative_and_recovery stdout ---- thread 'os_virtio_status_negative_and_recovery' (49464303) panicked at /reports/os-implementation/K1480-virtio-status-local-gxOYsT/mutant/kernel/tests/os/virtio_status.rs:44:5: assertion `left == right` failed left: Ok(()) right: Err(StillLive) note: run with `RUST_BACKTRACE=1` environment variable to display a backtrace failures: os_virtio_status_negative_and_recovery os_virtio_status_positive test result: FAILED. 0 passed; 2 failed; 0 ignored; 0 measured; 0 filtered out; finished in 0.00s