running 1 test test kernel_asid_zero_and_illegal_root_bits_never_encode ... FAILED failures: ---- kernel_asid_zero_and_illegal_root_bits_never_encode stdout ---- thread 'kernel_asid_zero_and_illegal_root_bits_never_encode' (41108212) panicked at tests/spaces.rs:148:9: assertion `left == right` failed left: Ok(1073745920) right: Err(Configuration) note: run with `RUST_BACKTRACE=1` environment variable to display a backtrace failures: kernel_asid_zero_and_illegal_root_bits_never_encode test result: FAILED. 0 passed; 1 failed; 0 ignored; 0 measured; 17 filtered out; finished in 0.00s Compiling turkos-os-address-spaces v0.1.0 (/reports/os-implementation/K821-K839-preparation-6JTwAT/mutant-kernel-asid-zero/os-address-spaces) Finished `test` profile [unoptimized + debuginfo] target(s) in 0.29s Running tests/spaces.rs (reports/os-implementation/K821-K839-preparation-6JTwAT/mutant-kernel-asid-zero/target/debug/build/turkos-os-address-spaces/8a8b018c19f35bf8/out/spaces-8a8b018c19f35bf8) error: test failed, to rerun pass `--test spaces`