running 1 test test free_map_may_not_contain_payload ... FAILED failures: failures: free_map_may_not_contain_payload test result: FAILED. 0 passed; 1 failed; 0 ignored; 0 measured; 8 filtered out; finished in 0.00s Compiling turkos-os-boot-regions v0.1.0 (/reports/os-implementation/K611-K614-EzW3BR/mutant-skip-free-audit/os-boot-regions) warning: unused variable: `free` --> src/regions.rs:165:13 | 165 | let free = Range::from_endpoints(free.start, free.end)?; | ^^^^ help: if this is intentional, prefix it with an underscore: `_free` | = note: `#[warn(unused_variables)]` (part of `#[warn(unused)]`) on by default warning: `turkos-os-boot-regions` (lib) generated 1 warning (run `cargo fix --lib -p turkos-os-boot-regions` to apply 1 suggestion) Finished `test` profile [unoptimized + debuginfo] target(s) in 0.22s Running tests/regions.rs (reports/os-implementation/K611-K614-EzW3BR/mutant-skip-free-audit/target/debug/build/turkos-os-boot-regions/7b192f17a667f2eb/out/regions-7b192f17a667f2eb) thread 'free_map_may_not_contain_payload' (39846025) panicked at tests/regions.rs:74:5: assertion `left == right` failed left: Ok(()) right: Err(FreeMapOverlap) note: run with `RUST_BACKTRACE=1` environment variable to display a backtrace error: test failed, to rerun pass `--test regions`