running 1 test test initial_canaries_and_whole_stack_zeroing_are_required_before_publication ... FAILED failures: failures: initial_canaries_and_whole_stack_zeroing_are_required_before_publication test result: FAILED. 0 passed; 1 failed; 0 ignored; 0 measured; 21 filtered out; finished in 0.00s Compiling turkos-os-threads v0.1.0 (/reports/os-implementation/K1001-K1019-preparation-Vy7GRN/mutant-initial-full-zero-ignored/os-threads) warning: unused variable: `initial` --> src/threads.rs:301:9 | 301 | initial: bool, | ^^^^^^^ help: if this is intentional, prefix it with an underscore: `_initial` | = note: `#[warn(unused_variables)]` (part of `#[warn(unused)]`) on by default warning: `turkos-os-threads` (lib) generated 1 warning (run `cargo fix --lib -p turkos-os-threads` to apply 1 suggestion) Finished `test` profile [unoptimized + debuginfo] target(s) in 0.30s Running tests/threads.rs (reports/os-implementation/K1001-K1019-preparation-Vy7GRN/mutant-initial-full-zero-ignored/target/debug/build/turkos-os-threads/fc0d96e38d2f6d6f/out/threads-fc0d96e38d2f6d6f) thread 'initial_canaries_and_whole_stack_zeroing_are_required_before_publication' (41559657) panicked at tests/threads.rs:464:76: called `Result::unwrap_err()` on an `Ok` value: ThreadId { table: 1, slot: 0, generation: 1 } note: run with `RUST_BACKTRACE=1` environment variable to display a backtrace error: test failed, to rerun pass `--test threads`