running 1 test test drain_refuses_new_work_and_keeps_source_until_last_queued_and_running_finish ... FAILED failures: ---- drain_refuses_new_work_and_keeps_source_until_last_queued_and_running_finish stdout ---- thread 'drain_refuses_new_work_and_keeps_source_until_last_queued_and_running_finish' (41612711) panicked at tests/deferred_work.rs:611:5: assertion `left == right` failed left: Ok(Coalesced(JobRecord { state: Queued, slot: 1, generation: 1, registration_slot: 0, registration_generation: 1, binding: Binding { device: 9, epoch: 1, owner: 101, cpu: 0 }, resource: 3, completions: 5, sequence: 2 })) right: Err(Draining) note: run with `RUST_BACKTRACE=1` environment variable to display a backtrace failures: drain_refuses_new_work_and_keeps_source_until_last_queued_and_running_finish test result: FAILED. 0 passed; 1 failed; 0 ignored; 0 measured; 27 filtered out; finished in 0.00s Compiling turkos-os-deferred-work v0.1.0 (/reports/os-implementation/K981-K999-preparation-0bsVMr/mutant-missing-drain-refusal/os-deferred-work) Finished `test` profile [unoptimized + debuginfo] target(s) in 0.51s Running tests/deferred_work.rs (reports/os-implementation/K981-K999-preparation-0bsVMr/mutant-missing-drain-refusal/target/debug/build/turkos-os-deferred-work/bfb4bf5e81b06a44/out/deferred_work-bfb4bf5e81b06a44) error: test failed, to rerun pass `--test deferred_work`