running 1 test test context::exhaustion_tests::deferred_epoch_exhaustion_does_not_publish_episode ... FAILED failures: failures: context::exhaustion_tests::deferred_epoch_exhaustion_does_not_publish_episode test result: FAILED. 0 passed; 1 failed; 0 ignored; 0 measured; 4 filtered out; finished in 0.00s Compiling turkos-os-threads v0.1.0 (/reports/os-implementation/K1021-K1039-preparation-EkLAoy/mutant-deferred-epoch-wrapped/os-threads) Compiling turkos-os-exceptions v0.1.0 (/reports/os-implementation/K1021-K1039-preparation-EkLAoy/mutant-deferred-epoch-wrapped/os-exceptions) Compiling turkos-os-context-switch v0.1.0 (/reports/os-implementation/K1021-K1039-preparation-EkLAoy/mutant-deferred-epoch-wrapped/os-context-switch) Finished `test` profile [unoptimized + debuginfo] target(s) in 0.34s Running unittests src/lib.rs (reports/os-implementation/K1021-K1039-preparation-EkLAoy/mutant-deferred-epoch-wrapped/target/debug/build/turkos-os-context-switch/7dcb92efcfdbc32c/out/turkos_os_context_switch-7dcb92efcfdbc32c) thread 'context::exhaustion_tests::deferred_epoch_exhaustion_does_not_publish_episode' (41795344) panicked at src/context.rs:1249:9: assertion `left == right` failed left: Ok(0) right: Err(Exhausted) note: run with `RUST_BACKTRACE=1` environment variable to display a backtrace error: test failed, to rerun pass `--lib`