running 1 test test serviced_token_cannot_execute_callback_twice ... FAILED failures: ---- serviced_token_cannot_execute_callback_twice stdout ---- thread 'serviced_token_cannot_execute_callback_twice' (41615945) panicked at tests/deferred_work.rs:723:5: assertion `left == right` failed left: Ok(()) right: Err(AlreadyServiced) note: run with `RUST_BACKTRACE=1` environment variable to display a backtrace failures: serviced_token_cannot_execute_callback_twice test result: FAILED. 0 passed; 1 failed; 0 ignored; 0 measured; 27 filtered out; finished in 0.00s Compiling turkos-os-deferred-work v0.1.0 (/reports/os-implementation/K981-K999-preparation-0bsVMr/mutant-duplicate-service/os-deferred-work) Finished `test` profile [unoptimized + debuginfo] target(s) in 0.44s Running tests/deferred_work.rs (reports/os-implementation/K981-K999-preparation-0bsVMr/mutant-duplicate-service/target/debug/build/turkos-os-deferred-work/bfb4bf5e81b06a44/out/deferred_work-bfb4bf5e81b06a44) error: test failed, to rerun pass `--test deferred_work`