running 1 test test nested_syscall_and_irq_frames_are_disjoint_and_lifo ... FAILED failures: ---- nested_syscall_and_irq_frames_are_disjoint_and_lifo stdout ---- thread 'nested_syscall_and_irq_frames_are_disjoint_and_lifo' (41253905) panicked at tests/exceptions.rs:450:5: assertion `left == right` failed left: Err(Stale) right: Err(Order) note: run with `RUST_BACKTRACE=1` environment variable to display a backtrace failures: nested_syscall_and_irq_frames_are_disjoint_and_lifo test result: FAILED. 0 passed; 1 failed; 0 ignored; 0 measured; 22 filtered out; finished in 0.00s Compiling turkos-os-exceptions v0.1.0 (/reports/os-implementation/K901-K919-preparation-EQ5mcc/mutant-non-lifo-return/os-exceptions) Finished `test` profile [unoptimized + debuginfo] target(s) in 0.27s Running tests/exceptions.rs (reports/os-implementation/K901-K919-preparation-EQ5mcc/mutant-non-lifo-return/target/debug/build/turkos-os-exceptions/75414a6222e92fd7/out/exceptions-75414a6222e92fd7) error: test failed, to rerun pass `--test exceptions`