running 2 tests test os_vfs_inode_table_positive ... ok test os_vfs_inode_table_negative ... FAILED failures: ---- os_vfs_inode_table_negative stdout ---- thread 'os_vfs_inode_table_negative' (50206717) panicked at /reports/os-implementation/K1610-vfs-inode-table-local-jhCf6m/mutant/kernel/tests/os/vfs_inode_table.rs:29:5: assertion `left == right` failed left: Ok(Table { rows: [Inode { number: 1, kind: Directory, links: 1, size: 0, first_block: 0, block_count: 0, reserved: 0 }, Inode { number: 2, kind: Regular, links: 1, size: 513, first_block: 100, block_count: 2, reserved: 0 }, Inode { number: 2, kind: Regular, links: 1, size: 1, first_block: 200, block_count: 1, reserved: 0 }], disk_blocks: 2048 }) right: Err(DuplicateInode) note: run with `RUST_BACKTRACE=1` environment variable to display a backtrace failures: os_vfs_inode_table_negative test result: FAILED. 1 passed; 1 failed; 0 ignored; 0 measured; 0 filtered out; finished in 0.00s