running 1 test test coalescing_count_overflow_preserves_original_multiplicity_and_lease ... FAILED failures: ---- coalescing_count_overflow_preserves_original_multiplicity_and_lease stdout ---- thread 'coalescing_count_overflow_preserves_original_multiplicity_and_lease' (41613959) panicked at tests/deferred_work.rs:823:5: assertion `left == right` failed left: Ok(Coalesced(JobRecord { state: Queued, slot: 0, generation: 1, registration_slot: 0, registration_generation: 1, binding: Binding { device: 9, epoch: 1, owner: 101, cpu: 0 }, resource: 2, completions: 0, sequence: 1 })) right: Err(Overflow) note: run with `RUST_BACKTRACE=1` environment variable to display a backtrace failures: coalescing_count_overflow_preserves_original_multiplicity_and_lease test result: FAILED. 0 passed; 1 failed; 0 ignored; 0 measured; 27 filtered out; finished in 0.00s Compiling turkos-os-deferred-work v0.1.0 (/reports/os-implementation/K981-K999-preparation-0bsVMr/mutant-wrapping-multiplicity/os-deferred-work) Finished `test` profile [unoptimized + debuginfo] target(s) in 0.54s Running tests/deferred_work.rs (reports/os-implementation/K981-K999-preparation-0bsVMr/mutant-wrapping-multiplicity/target/debug/build/turkos-os-deferred-work/bfb4bf5e81b06a44/out/deferred_work-bfb4bf5e81b06a44) error: test failed, to rerun pass `--test deferred_work`