running 1 test test guard_failure_returns_prepared_backing_without_consuming_generation ... FAILED failures: failures: guard_failure_returns_prepared_backing_without_consuming_generation test result: FAILED. 0 passed; 1 failed; 0 ignored; 0 measured; 21 filtered out; finished in 0.00s Compiling turkos-os-threads v0.1.0 (/reports/os-implementation/K1001-K1019-preparation-Vy7GRN/mutant-stack-guard-ignored/os-threads) Finished `test` profile [unoptimized + debuginfo] target(s) in 0.28s Running tests/threads.rs (reports/os-implementation/K1001-K1019-preparation-Vy7GRN/mutant-stack-guard-ignored/target/debug/build/turkos-os-threads/fc0d96e38d2f6d6f/out/threads-fc0d96e38d2f6d6f) thread 'guard_failure_returns_prepared_backing_without_consuming_generation' (41559258) panicked at tests/threads.rs:322:64: called `Result::unwrap_err()` on an `Ok` value: ThreadId { table: 1, slot: 0, generation: 1 } note: run with `RUST_BACKTRACE=1` environment variable to display a backtrace error: test failed, to rerun pass `--test threads`