running 2 tests test os_turkfs_namespace_create_positive ... ok test os_turkfs_namespace_create_negative ... FAILED failures: ---- os_turkfs_namespace_create_negative stdout ---- thread 'os_turkfs_namespace_create_negative' (50438689) panicked at /reports/os-implementation/K1645-turkfs-create-local-L4SfQN/mutant/kernel/tests/os/turkfs_namespace.rs:29:5: assertion `left == right` failed left: Namespace { entries: [Some(Entry { inode: 2, parent: 1, kind: Directory, name: [100, 111, 99, 115, 0, 0, 0, 0, 0, 0, 0, 0, 0, 0, 0, 0], name_length: 4 }), None, None, None], inode_bitmap: 15, quota: 1 } right: Namespace { entries: [Some(Entry { inode: 2, parent: 1, kind: Directory, name: [100, 111, 99, 115, 0, 0, 0, 0, 0, 0, 0, 0, 0, 0, 0, 0], name_length: 4 }), None, None, None], inode_bitmap: 7, quota: 1 } note: run with `RUST_BACKTRACE=1` environment variable to display a backtrace failures: os_turkfs_namespace_create_negative test result: FAILED. 1 passed; 1 failed; 0 ignored; 0 measured; 0 filtered out; finished in 0.00s