running 2 tests test os_turkfs_allocation_truncate_positive ... ok test os_turkfs_allocation_truncate_negative ... FAILED failures: ---- os_turkfs_allocation_truncate_negative stdout ---- thread 'os_turkfs_allocation_truncate_negative' (50411618) panicked at /reports/os-implementation/K1640-turkfs-truncate-local-gyd1BC/mutant/kernel/tests/os/turkfs_allocation_truncate.rs:43:5: assertion `left == right` failed left: Ok(()) right: Err(Busy) note: run with `RUST_BACKTRACE=1` environment variable to display a backtrace failures: os_turkfs_allocation_truncate_negative test result: FAILED. 1 passed; 1 failed; 0 ignored; 0 measured; 0 filtered out; finished in 0.00s