running 1 test test os_shell_foreground_wait_error_retains_owner ... FAILED failures: ---- os_shell_foreground_wait_error_retains_owner stdout ---- thread 'os_shell_foreground_wait_error_retains_owner' (48168821) panicked at tests/foreground.rs:58:5: assertion `left == right` failed left: Some(Pid(1)) right: None note: run with `RUST_BACKTRACE=1` environment variable to display a backtrace failures: os_shell_foreground_wait_error_retains_owner test result: FAILED. 0 passed; 1 failed; 0 ignored; 0 measured; 2 filtered out; finished in 0.00s Compiling turkos-os-shell-foreground v0.1.0 (/reports/os-implementation/K1275-foreground-local-preflight-IRfcKt/workspace/os-shell-foreground) Finished `test` profile [unoptimized + debuginfo] target(s) in 0.12s Running tests/foreground.rs (reports/os-implementation/K1275-foreground-local-preflight-IRfcKt/target/debug/build/turkos-os-shell-foreground/6328bf5f27243ff4/out/foreground-6328bf5f27243ff4) error: test failed, to rerun pass `--test foreground`