running 1 test test service_failure_quarantines_lease_and_failed_recovery_keeps_it_owned ... FAILED failures: ---- service_failure_quarantines_lease_and_failed_recovery_keeps_it_owned stdout ---- thread 'service_failure_quarantines_lease_and_failed_recovery_keeps_it_owned' (41616207) panicked at tests/deferred_work.rs:685:5: assertion `left == right` failed left: Ready right: Quarantined note: run with `RUST_BACKTRACE=1` environment variable to display a backtrace failures: service_failure_quarantines_lease_and_failed_recovery_keeps_it_owned test result: FAILED. 0 passed; 1 failed; 0 ignored; 0 measured; 27 filtered out; finished in 0.00s Compiling turkos-os-deferred-work v0.1.0 (/reports/os-implementation/K981-K999-preparation-0bsVMr/mutant-failed-service-not-quarantined/os-deferred-work) Finished `test` profile [unoptimized + debuginfo] target(s) in 0.50s Running tests/deferred_work.rs (reports/os-implementation/K981-K999-preparation-0bsVMr/mutant-failed-service-not-quarantined/target/debug/build/turkos-os-deferred-work/bfb4bf5e81b06a44/out/deferred_work-bfb4bf5e81b06a44) error: test failed, to rerun pass `--test deferred_work`