running 2 tests test os_pci_interrupts_positive ... ok test os_pci_interrupts_negative ... FAILED failures: ---- os_pci_interrupts_negative stdout ---- thread 'os_pci_interrupts_negative' (49195960) panicked at /reports/os-implementation/K1455-pci-intx-local-1QZ2X4/mutant/kernel/tests/os/pci_interrupts.rs:32:5: assertion `left == right` failed left: Ok(Route { source: Source { bus: 0, device: 3, function: 0, pin: 1 }, spi: 46 }) right: Err(DuplicateSource) note: run with `RUST_BACKTRACE=1` environment variable to display a backtrace failures: os_pci_interrupts_negative test result: FAILED. 1 passed; 1 failed; 0 ignored; 0 measured; 0 filtered out; finished in 0.00s